Target
Urokinase plasminogen activator surface receptor
Ligand
BDBM50402376
Substrate
Meas. Tech.
ChEMBL_886136 (CHEMBL2210436)
Ki
0.008±n/a nM
Citation
 Omar, MAShaker, YMGalal, SAAli, MMKerwin, SMLi, JTokuda, HRamadan, RAEl Diwani, HI Synthesis and docking studies of novel antitumor benzimidazoles. Bioorg Med Chem 20:6989-7001 (2012)  
Target
Name:
Urokinase plasminogen activator surface receptor
Synonyms:
CD_antigen=CD87 Monocyte activation antigen Mo3 U-PAR UPAR_HUMAN Urokinase receptor (uPAR) | Urokinase-type plasminogen activator/surface receptor
Type:
Receptor
Mol. Mass.:
36979.14
Organism:
Homo sapiens (Human)
Description:
Q03405
Residue:
335
  
Inhibitor
Name:
BDBM50402376
Synonyms:
CHEMBL2206688
Type:
Small organic molecule
Emp. Form.:
C16H12N4
Mol. Mass.:
260.2933
SMILES:
Nc1c(cc(-c2ccccc2)n1-c1ccncc1)C#N
: