Target
Neuropeptide FF receptor 1
Ligand
BDBM50402449
Substrate
Meas. Tech.
ChEMBL_886542 (CHEMBL2215251)
Ki
2±n/a nM
Citation
 Gealageas, RSchneider, SHumbert, JPBertin, ISchmitt, MLaboureyras, EDugave, CMollereau, CSimonnet, GBourguignon, JJSimonin, FBihel, F Development of sub-nanomolar dipeptidic ligands of neuropeptide FF receptors. Bioorg Med Chem Lett 22:7471-4 (2012)  
Target
Name:
Neuropeptide FF receptor 1
Synonyms:
G-protein coupled receptor 147 NPFF1 NPFFR1 | RFamide-related peptide receptor OT7T022
Type:
PROTEIN
Mol. Mass.:
47840.07
Organism:
Homo sapiens (Human)
Description:
ChEMBL_1474637
Residue:
430
  
Inhibitor
Name:
BDBM50402449
Synonyms:
CHEMBL2208325
Type:
Small organic molecule
Emp. Form.:
C28H32N6O3
Mol. Mass.:
500.5921
SMILES:
[#7]\[#6](-[#7])=[#7]\[#6]-[#6]-[#6]-[#6@@H](-[#7]-[#6](=O)-c1ccc(cc1)-c1ccccc1)-[#6](=O)-[#7]-[#6@@H](-[#6]-c1ccccc1)-[#6](-[#7])=O
: