Target
Advanced glycosylation end product-specific receptor
Ligand
BDBM50402564
Substrate
Meas. Tech.
ChEMBL_886755 (CHEMBL2210069)
IC50
1040±n/a nM
Citation
 Lee, YSKim, HKim, YHRoh, EJHan, HShin, KJ Synthesis and structure-activity relationships of tri-substituted thiazoles as RAGE antagonists for the treatment of Alzheimer's disease. Bioorg Med Chem Lett 22:7555-61 (2012)  
Target
Name:
Advanced glycosylation end product-specific receptor
Synonyms:
AGER RAGE_HUMAN | Receptor for advanced glycosylation end products
Type:
PROTEIN
Mol. Mass.:
42800.11
Organism:
Homo sapiens (Human)
Description:
ChEMBL_1339877
Residue:
404
  
Inhibitor
Name:
BDBM50402564
Synonyms:
CHEMBL2205549
Type:
Small organic molecule
Emp. Form.:
C32H35ClN2O2S
Mol. Mass.:
547.151
SMILES:
CCCCc1sc(nc1-c1ccc(Oc2ccc(Cl)cc2)cc1)-c1ccc(OCCN2CCCCC2)cc1
: