Target
5-hydroxytryptamine receptor 6
Ligand
BDBM50402715
Substrate
Meas. Tech.
ChEMBL_886900 (CHEMBL2211856)
Ki
53.62±n/a nM
Citation
 Nirogi, RVBadange, RKambhampati, RChindhe, ADeshpande, ADTiriveedhi, VKandikere, VMuddana, NAbraham, RKhagga, M Design, synthesis and pharmacological evaluation of 4-(piperazin-1-yl methyl)-N1-arylsulfonyl indole derivatives as 5-HT6 receptor ligands. Bioorg Med Chem Lett 22:7431-5 (2012)  
Target
Name:
5-hydroxytryptamine receptor 6
Synonyms:
5-HT-6 5-hydroxytryptamine receptor 6 (5-HT-6) 5-hydroxytryptamine receptor 6 (5HT6) HTR6 Serotonin 6 (5-HT6) receptor | Serotonin Receptor 6
Type:
G Protein-Coupled Receptor (GPCR)
Mol. Mass.:
46968.43
Organism:
Homo sapiens (Human)
Description:
P50406
Residue:
440
  
Inhibitor
Name:
BDBM50402715
Synonyms:
CHEMBL2207377
Type:
Small organic molecule
Emp. Form.:
C20H22ClN3O2S
Mol. Mass.:
403.926
SMILES:
CN1CCN(Cc2cccc3n(cc(Cl)c23)S(=O)(=O)c2ccccc2)CC1
: