Target
Diacylglycerol O-acyltransferase 1
Ligand
BDBM50402748
Substrate
Meas. Tech.
ChEMBL_886994 (CHEMBL2212889)
IC50
9000±n/a nM
Citation
 Lee, KGoo, JIJung, HYKim, MBoovanahalli, SKPark, HRKim, MOKim, DHLee, HSChoi, Y Discovery of a novel series of benzimidazole derivatives as diacylglycerol acyltransferase inhibitors. Bioorg Med Chem Lett 22:7456-60 (2012)  
Target
Name:
Diacylglycerol O-acyltransferase 1
Synonyms:
DGAT1_RAT Dgat1 Diacylglycerol O-acyltransferase 1 | Diglyceride acyltransferase
Type:
Multi-pass membrane protein
Mol. Mass.:
56890.70
Organism:
Rattus norvegicus (rat)
Description:
Residue:
498
  
Inhibitor
Name:
BDBM50402748
Synonyms:
CHEMBL2207794
Type:
Small organic molecule
Emp. Form.:
C24H25N3O3
Mol. Mass.:
403.4736
SMILES:
CC(C)(C)c1ccc(OCc2nc3ccc(cc3[nH]2)C(=O)NCc2ccco2)cc1
: