Target
Mitogen-activated protein kinase 8
Ligand
BDBM50402842
Substrate
Meas. Tech.
ChEMBL_884764 (CHEMBL2216094)
IC50
14±n/a nM
Citation
 Gong, LTan, YCBoice, GAbbot, SMcCaleb, KIyer, PZuo, FDal Porto, JWong, BJin, SChang, ATran, PHsieh, GNiu, LShao, AReuter, DLukacs, CMUrsula Kammlott, RKuglstatter, AGoldstein, D Discovery of a novel series of 4-quinolone JNK inhibitors. Bioorg Med Chem Lett 22:7381-7 (2012)  
Target
Name:
Mitogen-activated protein kinase 8
Synonyms:
JNK-46 JNK1-alpha-1 MK08_HUMAN PRKM8 SAPK1C c-Jun N-terminal kinase 1 c-Jun N-terminal kinase 1(JNK1) | c-Jun N-terminal kinase 2 (JNK2)
Type:
Enzyme
Mol. Mass.:
48297.57
Organism:
Homo sapiens (Human)
Description:
JNK-1 was purchased from Upstate Cell Signaling Solutions (formerly Upstate Biotechnology).
Residue:
427
  
Inhibitor
Name:
BDBM50402842
Synonyms:
CHEMBL2208438
Type:
Small organic molecule
Emp. Form.:
C25H23N3O5S
Mol. Mass.:
477.532
SMILES:
COC(=O)c1c(Cc2ccc(cc2)S(C)(=O)=O)c(=O)c2ccc(C)nc2n1-c1cccc(N)c1
: