Target
Cannabinoid receptor 2
Ligand
BDBM50402865
Substrate
Meas. Tech.
ChEMBL_885133 (CHEMBL2212767)
EC50
50±n/a nM
Citation
 Thur, YBhalerao, AMunshi, ZPansare, NMann, KHanauer, GKley, HPNappe, SWeiss-Haljiti, COstermann, CZitt, CSchaefer, MMondal, DAli Siddiki, AArmugam, VGudaghe, VGupta, MRayudu, PDautzenberg, FMDas Sarma, K Structure-activity relationships of 2-arylamido-5,7-dihydro-4H-thieno[2,3-c]pyran-3-carboxamide derivatives as cannabinoid receptor agonists and their analgesic action. Bioorg Med Chem Lett 22:7314-21 (2012)  
Target
Name:
Cannabinoid receptor 2
Synonyms:
CANNABINOID CB2 CB2 Cannabinoid CB2 receptor Cannabinoid receptor 2 mCB2
Type:
Enzyme Catalytic Domain
Mol. Mass.:
38220.43
Organism:
MOUSE
Description:
P47936
Residue:
347
  
Inhibitor
Name:
BDBM50402865
Synonyms:
CHEMBL2205621
Type:
Small organic molecule
Emp. Form.:
C20H21ClN2O3S
Mol. Mass.:
404.91
SMILES:
Clc1ccccc1C(=O)Nc1sc2CCCCc2c1C(=O)N1CCOCC1
: