Target
Mitogen-activated protein kinase 8
Ligand
BDBM50334268
Substrate
Meas. Tech.
ChEMBL_885281 (CHEMBL2214709)
IC50
>10000±n/a nM
Citation
 Terao, YSuzuki, HYoshikawa, MYashiro, HTakekawa, SFujitani, YOkada, KInoue, YYamamoto, YNakagawa, HYao, SKawamoto, TUchikawa, O Design and biological evaluation of imidazo[1,2-a]pyridines as novel and potent ASK1 inhibitors. Bioorg Med Chem Lett 22:7326-9 (2012)  
Target
Name:
Mitogen-activated protein kinase 8
Synonyms:
JNK-46 JNK1-alpha-1 MK08_HUMAN PRKM8 SAPK1C c-Jun N-terminal kinase 1 c-Jun N-terminal kinase 1(JNK1) | c-Jun N-terminal kinase 2 (JNK2)
Type:
Enzyme
Mol. Mass.:
48297.57
Organism:
Homo sapiens (Human)
Description:
JNK-1 was purchased from Upstate Cell Signaling Solutions (formerly Upstate Biotechnology).
Residue:
427
  
Inhibitor
Name:
BDBM50334268
Synonyms:
CHEMBL1642655 N-(6-(1H-imidazol-1-yl)imidazo[1,2-a]pyridin-2-yl)-4-tert-butylbenzamide
Type:
Small organic molecule
Emp. Form.:
C21H21N5O
Mol. Mass.:
359.4243
SMILES:
CC(C)(C)c1ccc(cc1)C(=O)Nc1cn2cc(ccc2n1)-n1ccnc1
: