Target
cGMP-inhibited 3',5'-cyclic phosphodiesterase 3A
Ligand
BDBM50402944
Substrate
Meas. Tech.
ChEMBL_885317 (CHEMBL2215180)
IC50
>30000±n/a nM
Citation
 Rzasa, RMHu, ERumfelt, SChen, NAndrews, KLChmait, SFalsey, JRZhong, WJones, ADPorter, ALouie, SWZhao, XTreanor, JJAllen, JR Discovery of selective biaryl ethers as PDE10A inhibitors: improvement in potency and mitigation of Pgp-mediated efflux. Bioorg Med Chem Lett 22:7371-5 (2012)  
Target
Name:
cGMP-inhibited 3',5'-cyclic phosphodiesterase 3A
Synonyms:
3',5'-cyclic phosphodiesterase Cyclic GMP-inhibited phosphodiesterase A PDE3A_HUMAN Phosphodiesterase 3 (PDE3) Phosphodiesterase 3A Phosphodiesterase 3A (PDE3A1) cGMP-inhibited 3',5'-cyclic phosphodiesterase A | cGMP-inhibited 3,5-cyclic phosphodiesterase A
Type:
Enzyme
Mol. Mass.:
124966.46
Organism:
Homo sapiens (Human)
Description:
Q14432
Residue:
1141
  
Inhibitor
Name:
BDBM50402944
Synonyms:
CHEMBL2206214
Type:
Small organic molecule
Emp. Form.:
C24H25N5O2
Mol. Mass.:
415.4876
SMILES:
OCC1CCN(CC1)c1ncccc1Oc1ccc(Nc2nc3ccccc3[nH]2)cc1
: