Target
cAMP and cAMP-inhibited cGMP 3',5'-cyclic phosphodiesterase 10A
Ligand
BDBM50402944
Substrate
Meas. Tech.
ChEMBL_885318 (CHEMBL2215181)
IC50
0.097±n/a nM
Citation
 Rzasa, RMHu, ERumfelt, SChen, NAndrews, KLChmait, SFalsey, JRZhong, WJones, ADPorter, ALouie, SWZhao, XTreanor, JJAllen, JR Discovery of selective biaryl ethers as PDE10A inhibitors: improvement in potency and mitigation of Pgp-mediated efflux. Bioorg Med Chem Lett 22:7371-5 (2012)  
Target
Name:
cAMP and cAMP-inhibited cGMP 3',5'-cyclic phosphodiesterase 10A
Synonyms:
3',5'-cyclic phosphodiesterase PDE10_HUMAN Phosphodiesterase 10A
Type:
Protein
Mol. Mass.:
88412.52
Organism:
Homo sapiens (Human)
Description:
Q9Y233
Residue:
779
  
Inhibitor
Name:
BDBM50402944
Synonyms:
CHEMBL2206214
Type:
Small organic molecule
Emp. Form.:
C24H25N5O2
Mol. Mass.:
415.4876
SMILES:
OCC1CCN(CC1)c1ncccc1Oc1ccc(Nc2nc3ccccc3[nH]2)cc1
: