Target
Endoplasmic reticulum mannosyl-oligosaccharide 1,2-alpha-mannosidase
Ligand
BDBM50402975
Substrate
Meas. Tech.
ChEMBL_885341 (CHEMBL2215204)
Ki
286850±n/a nM
Citation
 Moorthy, NSBrás, NFRamos, MJFernandes, PA Virtual screening and QSAR study of some pyrrolidine derivatives asa-mannosidase inhibitors for binding feature analysis. Bioorg Med Chem 20:6945-59 (2012)  
Target
Name:
Endoplasmic reticulum mannosyl-oligosaccharide 1,2-alpha-mannosidase
Synonyms:
MA1B1_HUMAN | MAN1B1
Type:
PROTEIN
Mol. Mass.:
79590.42
Organism:
Homo sapiens (Human)
Description:
ChEMBL_885341
Residue:
699
  
Inhibitor
Name:
BDBM50402975
Synonyms:
CHEMBL2206815
Type:
Small organic molecule
Emp. Form.:
C6H13NO4
Mol. Mass.:
163.1717
SMILES:
OC(O)C[C@H]1NC[C@H](O)[C@@H]1O
: