Target
Protein-tyrosine kinase 2-beta
Ligand
BDBM50402995
Substrate
Meas. Tech.
ChEMBL_885497 (CHEMBL2209549)
IC50
3600±n/a nM
Citation
 Bhattacharya, SKAspnes, GEBagley, SWBoehm, MBrosius, ADBuckbinder, LChang, JSDibrino, JEng, HFrederick, KSGriffith, DAGriffor, MCGuimarães, CRGuzman-Perez, AHan, SKalgutkar, ASKlug-McLeod, JGarcia-Irizarry, CLi, JLippa, BPrice, DASouthers, JAWalker, DPWei, LXiao, JZawistoski, MPZhao, X Identification of novel series of pyrazole and indole-urea based DFG-out PYK2 inhibitors. Bioorg Med Chem Lett 22:7523-9 (2012)  
Target
Name:
Protein-tyrosine kinase 2-beta
Synonyms:
CADTK CAKB Calcium-regulated non-receptor proline-rich tyrosine kinase FADK 2 Fak2 Focal adhesion kinase 2 Proline-rich tyrosine kinase 2 Pyk2 Related adhesion focal tyrosine kinase
Type:
PROTEIN
Mol. Mass.:
115790.07
Organism:
Mus musculus
Description:
ChEMBL_885497
Residue:
1009
  
Inhibitor
Name:
BDBM50402995
Synonyms:
CHEMBL2207436
Type:
Small organic molecule
Emp. Form.:
C22H24N8O2
Mol. Mass.:
432.4784
SMILES:
Cc1ccc(cc1)-n1nc(cc1NC(=O)Nc1cc(n[nH]1)-c1ccc(=O)[nH]n1)C(C)(C)C
: