Target
Carnitine O-palmitoyltransferase 1, liver isoform
Ligand
BDBM50403034
Substrate
Meas. Tech.
ChEMBL_887463 (CHEMBL2217072)
IC50
76400±n/a nM
Citation
 Ceccarelli, SMChomienne, OGubler, MArduini, A Carnitine palmitoyltransferase (CPT) modulators: a medicinal chemistry perspective on 35 years of research. J Med Chem 54:3109-52 (2011)  
Target
Name:
Carnitine O-palmitoyltransferase 1, liver isoform
Synonyms:
CPT I CPT1-L CPT1A_HUMAN Carnitine O-palmitoyltransferase I, liver isoform
Type:
PROTEIN
Mol. Mass.:
88389.31
Organism:
Homo sapiens (Human)
Description:
ChEMBL_887463
Residue:
773
  
Inhibitor
Name:
BDBM50403034
Synonyms:
CHEMBL2114397
Type:
Small organic molecule
Emp. Form.:
C7H16N2O2
Mol. Mass.:
160.2141
SMILES:
C[N+](C)(C)C[C@H](N)CC([O-])=O
: