Target
Carnitine O-palmitoyltransferase 1, muscle isoform
Ligand
BDBM50403035
Substrate
Meas. Tech.
ChEMBL_887462 (CHEMBL2217071)
IC50
>100000±n/a nM
Citation
 Ceccarelli, SMChomienne, OGubler, MArduini, A Carnitine palmitoyltransferase (CPT) modulators: a medicinal chemistry perspective on 35 years of research. J Med Chem 54:3109-52 (2011)  
Target
Name:
Carnitine O-palmitoyltransferase 1, muscle isoform
Synonyms:
CPT I CPT1B CPTI-M Carnitine palmitoyltransferase I-like protein | KIAA1670
Type:
PROTEIN
Mol. Mass.:
87823.36
Organism:
Homo sapiens (Human)
Description:
ChEMBL_887440
Residue:
772
  
Inhibitor
Name:
BDBM50403035
Synonyms:
OXFENICINE
Type:
Small organic molecule
Emp. Form.:
C8H9NO3
Mol. Mass.:
167.162
SMILES:
N[C@H](C(O)=O)c1ccc(O)cc1
: