Target
Thromboxane A2 receptor
Ligand
BDBM50391312
Substrate
Meas. Tech.
ChEMBL_209607 (CHEMBL816693)
Kd
3.16±n/a nM
Citation
 Campbell, ICollington, EFinch, HHayes, RLumley, PMills, KRobertson, GWharton, KWatts, I Synthesis and pharmacological evaluation of combined Thromboxane receptor antagonists/thromboxane synthase inhibitors: Pyridine-containing amino-prostanoids Bioorg Med Chem Lett 1:695-698 (1991)    Article 
Target
Name:
Thromboxane A2 receptor
Synonyms:
Prostanoid TP receptor TBXA2R Thromboxane Thromboxane Beta
Type:
Enyzme
Mol. Mass.:
37445.28
Organism:
Homo sapiens (Human)
Description:
P21731
Residue:
343
  
Inhibitor
Name:
BDBM50391312
Synonyms:
CHEMBL345876
Type:
Small organic molecule
Emp. Form.:
C33H46N2O4
Mol. Mass.:
534.7293
SMILES:
CC(C)(C)c1ccncc1-c1ccc(CO[C@@H]2CC[C@@H]([C@H]2OC\C=C/CCC(O)=O)N2CCCCCC2)cc1
: