Target
Thromboxane A2 receptor
Ligand
BDBM50391310
Substrate
Meas. Tech.
ChEMBL_209756 (CHEMBL815547)
Kd
25.12±n/a nM
Citation
 Campbell, ICollington, EFinch, HHayes, RLumley, PMills, KRobertson, GWharton, KWatts, I Synthesis and pharmacological evaluation of combined Thromboxane receptor antagonists/thromboxane synthase inhibitors: Pyridine-containing amino-prostanoids Bioorg Med Chem Lett 1:695-698 (1991)    Article 
Target
Name:
Thromboxane A2 receptor
Synonyms:
TA2R_RAT Tbxa2r | Thromboxane A2
Type:
Enzyme Catalytic Domain
Mol. Mass.:
36943.05
Organism:
RAT
Description:
Thromboxane A2 TBXA2R RAT::P34978
Residue:
341
  
Inhibitor
Name:
BDBM50391310
Synonyms:
CHEMBL158875
Type:
Small organic molecule
Emp. Form.:
C30H40N2O5
Mol. Mass.:
508.649
SMILES:
OCc1cncc(c1)-c1ccc(CO[C@@H]2CC[C@@H]([C@H]2OC\C=C/CCC(O)=O)N2CCCCCC2)cc1
: