Target
5-hydroxytryptamine receptor 1A
Ligand
BDBM50403670
Substrate
Meas. Tech.
ChEMBL_1006 (CHEMBL616049)
EC50
1.3±n/a nM
Citation
 van Steen, BJvan Wijngaarden, IRonken, ESoudijn, W Functional characteristics of a series of N4-substituted 1-(2,3-dihydro-1,4-benzodioxin-5-yl)piperazines as 5-HT1A receptor ligands. Structure-activity relationships. Bioorg Med Chem Lett 8:2457-62 (1999)  
Target
Name:
5-hydroxytryptamine receptor 1A
Synonyms:
5-HT-1A 5-hydroxytryptamine receptor 1A (5-HT-1A) ADRB2RL1 Dopamine D2 receptor and serotonin 1a receptor HTR1A | Serotonin receptor 1A
Type:
Mol. Mass.:
46122.49
Organism:
Homo sapiens (Human)
Description:
Residue:
422
  
Inhibitor
Name:
BDBM50403670
Synonyms:
CHEMBL311015
Type:
Small organic molecule
Emp. Form.:
C24H27N3O4
Mol. Mass.:
421.4889
SMILES:
O=C1N(CCCCN2CCN(CC2)c2cccc3OCCOc23)C(=O)c2ccccc12
: