Target
Protein c-Fos/Transcription factor Jun
Ligand
BDBM50090428
Substrate
Meas. Tech.
ChEMBL_92286 (CHEMBL705832)
IC50
5000±n/a nM
Citation
 Palanki, MSErdman, PEManning, AMOw, ARansone, LJSpooner, CSuto, CSuto, M Novel inhibitors of AP-1 and NF-kappaB mediated gene expression: structure-activity relationship studies of ethyl 4-[(3-methyl-2,5-dioxo(3-pyrrolinyl))amino]-2-(trifluoromethyl)++ +pyrimidi ne-5-carboxylate. Bioorg Med Chem Lett 10:1645-8 (2000)  
Target
Name:
Protein c-Fos/Transcription factor Jun
Synonyms:
Proto-oncogene c-JUN/protein c-fos | Transcription factor AP1
Type:
Mol. Mass.:
Description:
ASSAY_ID of EBI is 305353
Components:
This complex has 2 components.
Component 1
Name:
Transcription factor Jun
Synonyms:
AP1 JUN Proto-oncogene c-JUN Transcription factor AP1 p39
Type:
Mol. Mass.:
35683.24
Organism:
Homo sapiens (Human)
Description:
P05412
Residue:
331
  
Component 2
Name:
Protein c-Fos
Synonyms:
FOS G0S7 | Transcription factor AP1
Type:
PROTEIN
Mol. Mass.:
40679.34
Organism:
Homo sapiens (Human)
Description:
EBI_100167
Residue:
380
  
Inhibitor
Name:
BDBM50090428
Synonyms:
4-(3-Methyl-2,5-dioxo-2,5-dihydro-pyrrol-1-ylamino)-2-thiophen-2-yl-pyrimidine-5-carbonitrile CHEMBL42503
Type:
Small organic molecule
Emp. Form.:
C14H9N5O2S
Mol. Mass.:
311.319
SMILES:
CC1=CC(=O)N(Nc2nc(ncc2C#N)-c2cccs2)C1=O
: