Target
Delta-type opioid receptor
Ligand
BDBM50218554
Substrate
Meas. Tech.
ChEMBL_146342 (CHEMBL753791)
Ki
1±n/a nM
Citation
 Santagada, VBalboni, GCaliendo, GGuerrini, RSalvadori, SBianchi, CBryant, SDLazarus, LH Assessment of substitution in the second pharmacophore of Dmt-Tic analogues. Bioorg Med Chem Lett 10:2745-8 (2000)  
Target
Name:
Delta-type opioid receptor
Synonyms:
DOR-1 MSL-2 OPRD_MOUSE Oprd1
Type:
Enzyme Catalytic Domain
Mol. Mass.:
40577.25
Organism:
MOUSE
Description:
P32300
Residue:
372
  
Inhibitor
Name:
BDBM50218554
Synonyms:
CHEMBL93131
Type:
Small organic molecule
Emp. Form.:
C20H23BrN2O2
Mol. Mass.:
403.313
SMILES:
Cc1cc(O)cc(C)c1C[C@H](N)C(=O)N1CCc2ccc(Br)cc2C1
: