Target
Acyl carrier protein,/NADH dehydrogenase [ubiquinone] flavoprotein 1, mitochondrial
Ligand
BDBM50403901
Substrate
Meas. Tech.
ChEMBL_141738 (CHEMBL749250)
IC50
0.210000±n/a nM
Citation
 Tormo, JREstornell, EGallardo, TGonzález, MCCavé, AGranell, SCortes, DZafra-Polo, MC Gamma-lactone-Functionalized antitumoral acetogenins are the most potent inhibitors of mitochondrial complex I. Bioorg Med Chem Lett 11:681-4 (2001)  
Target
Name:
Acyl carrier protein,/NADH dehydrogenase [ubiquinone] flavoprotein 1, mitochondrial
Synonyms:
Mitochondrial complex I; NADH oxidoreductase
Type:
Mol. Mass.:
Description:
ASSAY_ID of EBI is 141738
Components:
This complex has 2 components.
Component 1
Name:
NADH dehydrogenase [ubiquinone] flavoprotein 1, mitochondrial
Synonyms:
CI-51kD NADH dehydrogenase flavoprotein 1 NDUFV1 UQOR1
Type:
PROTEIN
Mol. Mass.:
50659.85
Organism:
Bos taurus
Description:
EBI_100771
Residue:
464
  
Component 2
Name:
Acyl carrier protein, mitochondrial
Synonyms:
ACP CI-SDAP NDUFAB1
Type:
PROTEIN
Mol. Mass.:
17397.64
Organism:
Bos taurus
Description:
ChEMBL_469770
Residue:
156
  
Inhibitor
Name:
BDBM50403901
Synonyms:
CHEMBL349693
Type:
Small organic molecule
Emp. Form.:
C35H64O7
Mol. Mass.:
596.8785
SMILES:
CCCCCCCCCC[C@H](O)[C@H]1CC[C@@H](O1)[C@H]1CC[C@@H](O1)[C@H](O)CCCCCCCCCCC1[C@@H](O)[C@H](C)OC1=O
: