Target
Integrin alpha-V/beta-3
Ligand
BDBM50107412
Substrate
Meas. Tech.
ChEMBL_32655 (CHEMBL642823)
IC50
0.040000±n/a nM
Citation
 Coleman, PJBrashear, KMHunt, CAHoffman, WFHutchinson, JHBreslin, MJMcVean, CAAskew, BCHartman, GDRodan, SBRodan, GALeu, CTPrueksaritanont, TFernandez-Metzler, CMa, BLibby, LAMerkle, KMStump, GLWallace, AALynch, JJLynch, RDuggan, ME Non-peptide alpha(v)beta(3) antagonists. Part 3: identification of potent RGD mimetics incorporating novel beta-amino acids as aspartic acid replacements. Bioorg Med Chem Lett 12:31-4 (2001)  
Target
Name:
Integrin alpha-V/beta-3
Synonyms:
ITGAV/ITGB3 | Integrin beta-3/Vitronectin receptor alpha
Type:
Enzyme
Mol. Mass.:
Description:
Components:
This complex has 2 components.
Component 1
Name:
Integrin alpha-V
Synonyms:
ITAV_HUMAN Integrin alpha-V/alpha-5 VNRA Vitronectin receptor | Vitronectin receptor subunit alpha
Type:
PROTEIN
Mol. Mass.:
116024.92
Organism:
Homo sapiens (Human)
Description:
ChEMBL_582336
Residue:
1048
  
Component 2
Name:
Integrin beta-3
Synonyms:
CD_antigen=CD61 GPIIIa ITGB3 Platelet membrane glycoprotein IIIa
Type:
Protein
Mol. Mass.:
87038.91
Organism:
Homo sapiens (Human)
Description:
P05106
Residue:
788
  
Inhibitor
Name:
BDBM50107412
Synonyms:
3-(2-{2-Oxo-3-[2-(5,6,7,8-tetrahydro-[1,8]naphthyridin-2-yl)-ethyl]-pyrrolidin-1-yl}-acetylamino)-3-quinolin-3-yl-propionic acid | CHEMBL116123
Type:
Small organic molecule
Emp. Form.:
C28H31N5O4
Mol. Mass.:
501.5768
SMILES:
OC(=O)C[C@H](NC(=O)CN1CC[C@H](CCc2ccc3CCCNc3n2)C1=O)c1cnc2ccccc2c1
: