Target
Integrin alpha-V/beta-3
Ligand
BDBM50116975
Substrate
Meas. Tech.
ChEMBL_217801 (CHEMBL823257)
IC50
1.6±n/a nM
Citation
 Coleman, PJAskew, BCHutchinson, JHWhitman, DBPerkins, JJHartman, GDRodan, GALeu, CTPrueksaritanont, TFernandez-Metzler, CMerkle, KMLynch, RLynch, JJRodan, SBDuggan, ME Non-peptide alpha(v)beta(3) antagonists. Part 4: potent and orally bioavailable chain-shortened RGD mimetics. Bioorg Med Chem Lett 12:2463-5 (2002)  
Target
Name:
Integrin alpha-V/beta-3
Synonyms:
ITGAV/ITGB3 | Integrin beta-3/Vitronectin receptor alpha
Type:
Enzyme
Mol. Mass.:
Description:
Components:
This complex has 2 components.
Component 1
Name:
Integrin alpha-V
Synonyms:
ITAV_HUMAN Integrin alpha-V/alpha-5 VNRA Vitronectin receptor | Vitronectin receptor subunit alpha
Type:
PROTEIN
Mol. Mass.:
116024.92
Organism:
Homo sapiens (Human)
Description:
ChEMBL_582336
Residue:
1048
  
Component 2
Name:
Integrin beta-3
Synonyms:
CD_antigen=CD61 GPIIIa ITGB3 Platelet membrane glycoprotein IIIa
Type:
Protein
Mol. Mass.:
87038.91
Organism:
Homo sapiens (Human)
Description:
P05106
Residue:
788
  
Inhibitor
Name:
BDBM50116975
Synonyms:
(S)-3-Quinolin-3-yl-3-(5-5,6,7,8-tetrahydro-[1,8]naphthyridin-2-yl-pentanoylamino)-propionic acid | CHEMBL79248
Type:
Small organic molecule
Emp. Form.:
C25H28N4O3
Mol. Mass.:
432.5148
SMILES:
OC(=O)C[C@H](NC(=O)CCCCc1ccc2CCCNc2n1)c1cnc2ccccc2c1
: