Target
Muscarinic acetylcholine receptor M3
Ligand
BDBM50220556
Substrate
Meas. Tech.
ChEMBL_138828 (CHEMBL752410)
Ki
16±n/a nM
Citation
 Diouf, OGadeau, SChellé, FGelbcke, MTalaga, PChristophe, BGillard, MMassingham, RGuyaux, M A new series of M3 muscarinic antagonists based on the 4-amino-piperidine scaffold. Bioorg Med Chem Lett 12:2535-9 (2002)  
Target
Name:
Muscarinic acetylcholine receptor M3
Synonyms:
ACM3_HUMAN Cholinergic, muscarinic M3 Muscarinic receptor M3 | RecName: Full=Muscarinic acetylcholine receptor M3
Type:
Enzyme
Mol. Mass.:
66151.03
Organism:
Homo sapiens (Human)
Description:
P20309
Residue:
590
  
Inhibitor
Name:
BDBM50220556
Synonyms:
CHEMBL83363
Type:
Small organic molecule
Emp. Form.:
C23H28N2O
Mol. Mass.:
348.4812
SMILES:
O=C(C1CCC1)N(C1CCN(Cc2ccccc2)CC1)c1ccccc1
: