Target
Alpha-1A adrenergic receptor
Ligand
BDBM50403975
Substrate
Meas. Tech.
ChEBML_33869
IC50
14±n/a nM
Citation
 Andrés, JIAlcázar, JAlonso, JMDíaz, AFernández, JGil, PIturrino, LMatesanz, EMeert, TFMegens, ASipido, VK Synthesis and structure-activity relationship of 2-(aminoalkyl)-2,3,3a,8-tetrahydrodibenzo[c,f]isoxazolo[2,3-a]azepine derivatives: a novel series of 5-HT(2A/2C) receptor antagonists. Part 2. Bioorg Med Chem Lett 12:249-53 (2001)  
Target
Name:
Alpha-1A adrenergic receptor
Synonyms:
ADA1A_HUMAN ADRA1C Alpha 1A-adrenoceptor Alpha adrenergic receptor 1a Alpha-adrenergic receptor 1c adrenergic Alpha1 | adrenergic Alpha1C
Type:
Cell-surface receptors
Mol. Mass.:
51511.67
Organism:
Homo sapiens (Human)
Description:
P35348
Residue:
466
  
Inhibitor
Name:
BDBM50403975
Synonyms:
CHEMBL315772
Type:
Small organic molecule
Emp. Form.:
C19H21ClN2O
Mol. Mass.:
328.836
SMILES:
CN(C)CC1CC2N(O1)c1cc(Cl)ccc1Cc1ccccc21
: