Target
5-hydroxytryptamine receptor 1D
Ligand
BDBM50403974
Substrate
Meas. Tech.
ChEBML_1745
IC50
302±n/a nM
Citation
 Andrés, JIAlcázar, JAlonso, JMDíaz, AFernández, JGil, PIturrino, LMatesanz, EMeert, TFMegens, ASipido, VK Synthesis and structure-activity relationship of 2-(aminoalkyl)-2,3,3a,8-tetrahydrodibenzo[c,f]isoxazolo[2,3-a]azepine derivatives: a novel series of 5-HT(2A/2C) receptor antagonists. Part 2. Bioorg Med Chem Lett 12:249-53 (2001)  
Target
Name:
5-hydroxytryptamine receptor 1D
Synonyms:
5-HT-1D 5-HT1D 5HT1D_HUMAN HTR1DA Serotonin (5-HT) receptor | Serotonin Receptor 1D
Type:
G Protein-Coupled Receptor (GPCR)
Mol. Mass.:
41920.63
Organism:
Homo sapiens (Human)
Description:
Receptor binding assays were performed using human clone stably expressed in CHO cells.
Residue:
377
  
Inhibitor
Name:
BDBM50403974
Synonyms:
CHEMBL84931
Type:
Small organic molecule
Emp. Form.:
C19H21FN2O
Mol. Mass.:
312.3812
SMILES:
CN(C)CC1CC2N(O1)c1cc(F)ccc1Cc1ccccc21
: