Target
Trypsin
Ligand
BDBM50404104
Substrate
Meas. Tech.
ChEMBL_212329 (CHEMBL857532)
Ki
>5000±n/a nM
Citation
 Chou, YLDavey, DDEagen, KAGriedel, BDKaranjawala, RPhillips, GBSacchi, KLShaw, KJWu, SCLentz, DLiang, AMTrinh, LMorrissey, MMKochanny, MJ Structure-activity relationships of substituted benzothiophene-anthranilamide factor Xa inhibitors. Bioorg Med Chem Lett 13:507-11 (2003)  
Target
Name:
Trypsin
Synonyms:
Serine protease 1/Trypsin-2/Trypsin-3
Type:
Mol. Mass.:
Description:
ASSAY_ID of ChEMBL is 2155713
Components:
This complex has 3 components.
Component 1
Name:
Serine protease 1
Synonyms:
Alpha-trypsin chain 1 Beta-trypsin PRSS1 TRP1 TRY1_HUMAN Thrombin & trypsin Trypsin I | Trypsin-1
Type:
Enzyme
Mol. Mass.:
26557.80
Organism:
Homo sapiens (Human)
Description:
P07477
Residue:
247
  
Component 2
Name:
Trypsin-2
Synonyms:
Anionic trypsinogen Serine protease 2 TRY2_HUMAN Thrombin & trypsin Trypsin II | Trypsin-2
Type:
PROTEIN
Mol. Mass.:
26479.43
Organism:
Homo sapiens (Human)
Description:
ChEMBL_41517
Residue:
247
  
Component 3
Name:
Trypsin-3
Synonyms:
Brain trypsinogen PRSS3 Serine protease 3 TRY3 TRY4 Trypsin Trypsin IV | Trypsin-3
Type:
PROTEIN
Mol. Mass.:
32532.52
Organism:
Homo sapiens (Human)
Description:
ChEMBL_216043
Residue:
304
  
Inhibitor
Name:
BDBM50404104
Synonyms:
CHEMBL53011
Type:
Small organic molecule
Emp. Form.:
C24H19ClN2O3S
Mol. Mass.:
450.937
SMILES:
COc1ccc(NC(=O)c2cc(C)ccc2NC(=O)c2sc3ccccc3c2Cl)cc1
: