Target
Coagulation factor X
Ligand
BDBM17227
Substrate
Meas. Tech.
ChEBML_48837
Ki
0.600000±n/a nM
Citation
 Chou, YLDavey, DDEagen, KAGriedel, BDKaranjawala, RPhillips, GBSacchi, KLShaw, KJWu, SCLentz, DLiang, AMTrinh, LMorrissey, MMKochanny, MJ Structure-activity relationships of substituted benzothiophene-anthranilamide factor Xa inhibitors. Bioorg Med Chem Lett 13:507-11 (2003)  
Target
Name:
Coagulation factor X
Synonyms:
Activated coagulation factor X (FXa) Coagulation factor X precursor F10 Factor X heavy chain Factor Xa Stuart-Prower factor
Type:
Enzyme
Mol. Mass.:
54726.60
Organism:
Homo sapiens (Human)
Description:
Residue:
488
  
Inhibitor
Name:
BDBM17227
Synonyms:
3-chloro-N-{4-chloro-2-[(4-chlorophenyl)carbamoyl]phenyl}-1-benzothiophene-2-carboxamide | benzothiophene compound, 4
Type:
Small organic molecule
Emp. Form.:
C22H13Cl3N2O2S
Mol. Mass.:
475.775
SMILES:
Clc1c(sc2ccccc12)C(=O)Nc1ccc(Cl)cc1C(=O)Nc1ccc(Cl)cc1
: