Target
Integrin alpha-V/beta-3
Ligand
BDBM50125305
Substrate
Meas. Tech.
ChEMBL_214767 (CHEMBL816225)
Ki
4±n/a nM
Citation
 Urbahns, KHärter, MVaupel, AAlbers, MSchmidt, DBrüggemeier, UStelte-Ludwig, BGerdes, CTsujishita, H Biphenyls as potent vitronectin receptor antagonists. Part 2: biphenylalanine ureas. Bioorg Med Chem Lett 13:1071-4 (2003)  
Target
Name:
Integrin alpha-V/beta-3
Synonyms:
ITGAV/ITGB3 | Integrin beta-3/Vitronectin receptor alpha
Type:
Enzyme
Mol. Mass.:
Description:
Components:
This complex has 2 components.
Component 1
Name:
Integrin alpha-V
Synonyms:
ITAV_HUMAN Integrin alpha-V/alpha-5 VNRA Vitronectin receptor | Vitronectin receptor subunit alpha
Type:
PROTEIN
Mol. Mass.:
116024.92
Organism:
Homo sapiens (Human)
Description:
ChEMBL_582336
Residue:
1048
  
Component 2
Name:
Integrin beta-3
Synonyms:
CD_antigen=CD61 GPIIIa ITGB3 Platelet membrane glycoprotein IIIa
Type:
Protein
Mol. Mass.:
87038.91
Organism:
Homo sapiens (Human)
Description:
P05106
Residue:
788
  
Inhibitor
Name:
BDBM50125305
Synonyms:
(S)-3-[3'-(3-Propyl-ureido)-biphenyl-4-yl]-2-(2,4,6-trimethyl-benzenesulfonylamino)-propionic acid | CHEMBL11007
Type:
Small organic molecule
Emp. Form.:
C28H33N3O5S
Mol. Mass.:
523.644
SMILES:
CCCNC(=O)Nc1cccc(c1)-c1ccc(C[C@H](NS(=O)(=O)c2c(C)cc(C)cc2C)C(O)=O)cc1
: