Target
Dihydrofolate reductase
Ligand
BDBM50404479
Substrate
Meas. Tech.
ChEMBL_54243 (CHEMBL668120)
IC50
1500±n/a nM
Citation
 Roth, BAig, ELane, KRauckman, BS 2,4-Diamino-5-benzylpyrimidines as antibacterial agents. 4. 6-Substituted trimethoprim derivatives from phenolic Mannich intermediates. Application to the synthesis of trimethoprim and 3,5-dialkylbenzyl analogues. J Med Chem 23:535-41 (1980)  
Target
Name:
Dihydrofolate reductase
Synonyms:
Dihydrofolate reductase (F31V) | dfrA17
Type:
Mol. Mass.:
17532.46
Organism:
Escherichia coli
Description:
Residue:
157
  
Inhibitor
Name:
BDBM50404479
Synonyms:
CHEMBL150543
Type:
Small organic molecule
Emp. Form.:
C17H24N4O3
Mol. Mass.:
332.3975
SMILES:
CCCc1nc(N)nc(N)c1Cc1cc(OC)c(OC)c(OC)c1
: