Target
Inosine-5'-monophosphate dehydrogenase
Ligand
BDBM50367004
Substrate
Meas. Tech.
ChEBML_89668
Ki
137000±n/a nM
Citation
 Skibo, EBMeyer, RB Inhibition of inosinic acid dehydrogenase by 8-substituted purine nucleotides. J Med Chem 24:1155-61 (1982)  
Target
Name:
Inosine-5'-monophosphate dehydrogenase
Synonyms:
IMDH_ECOLI guaR
Type:
PROTEIN
Mol. Mass.:
52020.85
Organism:
Escherichia coli (strain K12)
Description:
ChEMBL_89670
Residue:
488
  
Inhibitor
Name:
BDBM50367004
Synonyms:
CHEMBL603973
Type:
Small organic molecule
Emp. Form.:
C16H18N5O7PS
Mol. Mass.:
455.382
SMILES:
Nc1ncnc2n(C3O[C@H](COP(O)(O)=O)[C@@H](O)[C@H]3O)c(Sc3ccccc3)nc12
: