Target
Inosine-5'-monophosphate dehydrogenase
Ligand
BDBM50367019
Substrate
Meas. Tech.
ChEBML_89668
Ki
19000±n/a nM
Citation
 Skibo, EBMeyer, RB Inhibition of inosinic acid dehydrogenase by 8-substituted purine nucleotides. J Med Chem 24:1155-61 (1982)  
Target
Name:
Inosine-5'-monophosphate dehydrogenase
Synonyms:
IMDH_ECOLI guaR
Type:
PROTEIN
Mol. Mass.:
52020.85
Organism:
Escherichia coli (strain K12)
Description:
ChEMBL_89670
Residue:
488
  
Inhibitor
Name:
BDBM50367019
Synonyms:
CHEMBL603762
Type:
Small organic molecule
Emp. Form.:
C18H18N5O8PS
Mol. Mass.:
495.403
SMILES:
O[C@@H]1[C@@H](COP(O)(O)=O)OC([C@@H]1O)n1c(SCc2ccc(cc2)C#N)nc2c1nc[nH]c2=O
: