Target
Malate dehydrogenase, mitochondrial
Ligand
BDBM50404709
Substrate
Meas. Tech.
ChEMBL_123822 (CHEMBL733653)
IC50
1584.89±n/a nM
Citation
 Coats, EAShah, KJMilstein, SRGenther, CSNene, DMRoesener, JSchmidt, JPleiss, MWagner, EBaker, JK 4-hydroxyquinoline-3-carboxylic acids as inhibitors of cell respiration. 2. Quantitative structure-activity relationship of dehydrogenase enzyme and Ehrlich ascites tumor cell inhibitions. J Med Chem 25:57-63 (1982)  
Target
Name:
Malate dehydrogenase, mitochondrial
Synonyms:
MDH2 Malate dehydrogenase mitochondrial
Type:
Oxidoreductase; homodimer
Mol. Mass.:
35493.48
Organism:
Sus scrofa (pig)
Description:
Porcine heart mitochondria.
Residue:
337
  
Inhibitor
Name:
BDBM50404709
Synonyms:
CHEMBL156707
Type:
Small organic molecule
Emp. Form.:
C22H17NO5
Mol. Mass.:
375.3741
SMILES:
OC(=O)c1cnc2cc(OCCOc3ccc4ccccc4c3)ccc2c1O
: