Target
Malate dehydrogenase, mitochondrial
Ligand
BDBM50404720
Substrate
Meas. Tech.
ChEMBL_123822 (CHEMBL733653)
IC50
18197.01±n/a nM
Citation
 Coats, EAShah, KJMilstein, SRGenther, CSNene, DMRoesener, JSchmidt, JPleiss, MWagner, EBaker, JK 4-hydroxyquinoline-3-carboxylic acids as inhibitors of cell respiration. 2. Quantitative structure-activity relationship of dehydrogenase enzyme and Ehrlich ascites tumor cell inhibitions. J Med Chem 25:57-63 (1982)  
Target
Name:
Malate dehydrogenase, mitochondrial
Synonyms:
MDH2 Malate dehydrogenase mitochondrial
Type:
Oxidoreductase; homodimer
Mol. Mass.:
35493.48
Organism:
Sus scrofa (pig)
Description:
Porcine heart mitochondria.
Residue:
337
  
Inhibitor
Name:
BDBM50404720
Synonyms:
CHEMBL155672
Type:
Small organic molecule
Emp. Form.:
C18H14FNO5
Mol. Mass.:
343.3059
SMILES:
OC(=O)c1cnc2cc(OCCOc3ccc(F)cc3)ccc2c1O
: