Target
Beta-1 adrenergic receptor
Ligand
BDBM25761
Substrate
Meas. Tech.
ChEMBL_37082 (CHEMBL650923)
Kd
2±n/a nM
Citation
 Erhardt, PWWoo, CMAnderson, WGGorczynski, RJ Ultra-short-acting beta-adrenergic receptor blocking agents. 2. (Aryloxy)propanolamines containing esters on the aryl function. J Med Chem 25:1408-12 (1983)  
Target
Name:
Beta-1 adrenergic receptor
Synonyms:
ADRB1 adrenergic Beta1
Type:
Enzyme Catalytic Domain
Mol. Mass.:
50540.48
Organism:
GUINEA PIG
Description:
adrenergic Beta1 ADRB1 GUINEA PIG::B0FL73
Residue:
467
  
Inhibitor
Name:
BDBM25761
Synonyms:
Anapriline CHEMBL27 PROPRANOLOL, d PROPRANOLOL,(+) Propanolol Propranolol | [2-hydroxy-3-(naphthalen-1-yloxy)propyl](propan-2-yl)amine
Type:
Small organic molecule
Emp. Form.:
C16H21NO2
Mol. Mass.:
259.3434
SMILES:
CC(C)NCC(O)COc1cccc2ccccc12
: