Target
Beta-1 adrenergic receptor
Ligand
BDBM50404790
Substrate
Meas. Tech.
ChEMBL_76828 (CHEMBL690656)
Kd
0.000001±n/a nM
Citation
 Erhardt, PWWoo, CMAnderson, WGGorczynski, RJ Ultra-short-acting beta-adrenergic receptor blocking agents. 2. (Aryloxy)propanolamines containing esters on the aryl function. J Med Chem 25:1408-12 (1983)  
Target
Name:
Beta-1 adrenergic receptor
Synonyms:
ADRB1 adrenergic Beta1
Type:
Enzyme Catalytic Domain
Mol. Mass.:
50540.48
Organism:
GUINEA PIG
Description:
adrenergic Beta1 ADRB1 GUINEA PIG::B0FL73
Residue:
467
  
Inhibitor
Name:
BDBM50404790
Synonyms:
CHEMBL13284
Type:
Small organic molecule
Emp. Form.:
C14H21NO4
Mol. Mass.:
267.3208
SMILES:
COC(=O)c1ccccc1OCC(O)CNC(C)C
: