Target
Cytochrome P450 1A1
Ligand
BDBM50404854
Substrate
Meas. Tech.
ChEMBL_36220 (CHEMBL647916)
IC50
82000±n/a nM
Citation
 Little, PJRyan, AJ Inhibitors of hepatic mixed-function oxidases. 4. Effects of benzimidazole and related compounds on aryl hydrocarbon hydroxylase activity from phenobarbitone and 3-methylcholanthrene induced rats. J Med Chem 25:622-6 (1982)  
Target
Name:
Cytochrome P450 1A1
Synonyms:
CP1A1_RAT Cyp1a1
Type:
PROTEIN
Mol. Mass.:
59401.56
Organism:
Rattus norvegicus
Description:
ChEMBL_774160
Residue:
524
  
Inhibitor
Name:
BDBM50404854
Synonyms:
CHEMBL155867
Type:
Small organic molecule
Emp. Form.:
C12H16N2
Mol. Mass.:
188.2688
SMILES:
CCCCCc1nc2ccccc2[nH]1
: