Target
Cytochrome P450 2B1
Ligand
BDBM50404881
Substrate
Meas. Tech.
ChEMBL_35524 (CHEMBL644757)
IC50
141253.75±n/a nM
Citation
 Murray, MRyan, AJLittle, PJ Inhibition of rat hepatic microsomal aminopyrine N-demethylase activity by benzimidazole derivatives. Quantitative structure-activity relationships. J Med Chem 25:887-92 (1982)  
Target
Name:
Cytochrome P450 2B1
Synonyms:
CP2B1_RAT Cyp2b1
Type:
PROTEIN
Mol. Mass.:
55940.51
Organism:
Rattus norvegicus
Description:
ChEMBL_774167
Residue:
491
  
Inhibitor
Name:
BDBM50404881
Synonyms:
CHEMBL169192
Type:
Small organic molecule
Emp. Form.:
C8H7ClN2
Mol. Mass.:
166.608
SMILES:
ClCc1nc2ccccc2[nH]1
: