Target
Cytochrome P450 2B1
Ligand
BDBM50404925
Substrate
Meas. Tech.
ChEMBL_35524 (CHEMBL644757)
IC50
22908.68±n/a nM
Citation
 Murray, MRyan, AJLittle, PJ Inhibition of rat hepatic microsomal aminopyrine N-demethylase activity by benzimidazole derivatives. Quantitative structure-activity relationships. J Med Chem 25:887-92 (1982)  
Target
Name:
Cytochrome P450 2B1
Synonyms:
CP2B1_RAT Cyp2b1
Type:
PROTEIN
Mol. Mass.:
55940.51
Organism:
Rattus norvegicus
Description:
ChEMBL_774167
Residue:
491
  
Inhibitor
Name:
BDBM50404925
Synonyms:
CHEMBL354972
Type:
Small organic molecule
Emp. Form.:
C14H11ClN2
Mol. Mass.:
242.704
SMILES:
Clc1cccc(Cc2nc3ccccc3[nH]2)c1
: