Target
Cytochrome P450 2B1
Ligand
BDBM50404926
Substrate
Meas. Tech.
ChEMBL_35524 (CHEMBL644757)
IC50
44668.36±n/a nM
Citation
 Murray, MRyan, AJLittle, PJ Inhibition of rat hepatic microsomal aminopyrine N-demethylase activity by benzimidazole derivatives. Quantitative structure-activity relationships. J Med Chem 25:887-92 (1982)  
Target
Name:
Cytochrome P450 2B1
Synonyms:
CP2B1_RAT Cyp2b1
Type:
PROTEIN
Mol. Mass.:
55940.51
Organism:
Rattus norvegicus
Description:
ChEMBL_774167
Residue:
491
  
Inhibitor
Name:
BDBM50404926
Synonyms:
CHEMBL355159
Type:
Small organic molecule
Emp. Form.:
C15H14N2O
Mol. Mass.:
238.2845
SMILES:
Cc1ccc(OCc2nc3ccccc3[nH]2)cc1
: