Target
Beta-1 adrenergic receptor
Ligand
BDBM50404980
Substrate
Meas. Tech.
ChEMBL_39350 (CHEMBL654957)
Kd
0.851000±n/a nM
Citation
 Baldwin, JJDenny, GHHirschmann, RFreedman, MBPonticello, GSGross, DMSweet, CS Beta 1-selective adrenoceptor antagonists: examples of the 2-[4-[3-(substituted-amino)-2-hydroxypropoxy]phenyl]imidazole class. J Med Chem 26:950-7 (1983)  
Target
Name:
Beta-1 adrenergic receptor
Synonyms:
ADRB1 adrenergic Beta1
Type:
Enzyme Catalytic Domain
Mol. Mass.:
50540.48
Organism:
GUINEA PIG
Description:
adrenergic Beta1 ADRB1 GUINEA PIG::B0FL73
Residue:
467
  
Inhibitor
Name:
BDBM50404980
Synonyms:
CHEMBL1788320
Type:
Small organic molecule
Emp. Form.:
C26H29N3O4S
Mol. Mass.:
479.591
SMILES:
COc1ccc(CCNC[C@H](O)COc2ccc(cc2)-c2nc(c[nH]2)-c2cccs2)cc1OC
: