Target
Beta-2 adrenergic receptor
Ligand
BDBM50404991
Substrate
Meas. Tech.
ChEMBL_38001 (CHEMBL651635)
Kd
45708.82±n/a nM
Citation
 Baldwin, JJDenny, GHHirschmann, RFreedman, MBPonticello, GSGross, DMSweet, CS Beta 1-selective adrenoceptor antagonists: examples of the 2-[4-[3-(substituted-amino)-2-hydroxypropoxy]phenyl]imidazole class. J Med Chem 26:950-7 (1983)  
Target
Name:
Beta-2 adrenergic receptor
Synonyms:
ADRB2_CAVPO adrenergic Beta2
Type:
Enzyme Catalytic Domain
Mol. Mass.:
46993.24
Organism:
GUINEA PIG
Description:
adrenergic Beta2 ADRB2 GUINEA PIG::Q8K4Z4
Residue:
418
  
Inhibitor
Name:
BDBM50404991
Synonyms:
CHEMBL174259
Type:
Small organic molecule
Emp. Form.:
C24H25N3O2S
Mol. Mass.:
419.539
SMILES:
OC(CNCCc1ccccc1)COc1ccc(cc1)-c1nc(c[nH]1)-c1cccs1
: