Target
DNA topoisomerase 3
Ligand
BDBM50028349
Substrate
Meas. Tech.
ChEMBL_54524 (CHEMBL663871)
Ki
31623±n/a nM
Citation
 Wright, GEGambino, JJ Quantitative structure-activity relationships of 6-anilinouracils as inhibitors of Bacillus subtilis DNA polymerase III. J Med Chem 27:181-5 (1984)  
Target
Name:
DNA topoisomerase 3
Synonyms:
DNA topoisomerase III topB
Type:
PROTEIN
Mol. Mass.:
81515.22
Organism:
Bacillus subtilis
Description:
ChEMBL_54525
Residue:
727
  
Inhibitor
Name:
BDBM50028349
Synonyms:
6-(4-Bromo-phenylamino)-1H-pyrimidine-2,4-dione | CHEMBL293964
Type:
Small organic molecule
Emp. Form.:
C10H8BrN3O2
Mol. Mass.:
282.093
SMILES:
Brc1ccc(Nc2cc(=O)[nH]c(=O)[nH]2)cc1
: