Target
DNA topoisomerase 3
Ligand
BDBM50028359
Substrate
Meas. Tech.
ChEBML_54524
Ki
280±n/a nM
Citation
 Wright, GEGambino, JJ Quantitative structure-activity relationships of 6-anilinouracils as inhibitors of Bacillus subtilis DNA polymerase III. J Med Chem 27:181-5 (1984)  
Target
Name:
DNA topoisomerase 3
Synonyms:
DNA topoisomerase III topB
Type:
PROTEIN
Mol. Mass.:
81515.22
Organism:
Bacillus subtilis
Description:
ChEMBL_54525
Residue:
727
  
Inhibitor
Name:
BDBM50028359
Synonyms:
6-(3-Iodo-4-methyl-phenylamino)-1H-pyrimidine-2,4-dione | CHEMBL56014
Type:
Small organic molecule
Emp. Form.:
C11H10IN3O2
Mol. Mass.:
343.1205
SMILES:
Cc1ccc(Nc2cc(=O)[nH]c(=O)[nH]2)cc1I
: