Target
DNA topoisomerase 3
Ligand
BDBM50405106
Substrate
Meas. Tech.
ChEBML_54524
Ki
132130±n/a nM
Citation
 Wright, GEGambino, JJ Quantitative structure-activity relationships of 6-anilinouracils as inhibitors of Bacillus subtilis DNA polymerase III. J Med Chem 27:181-5 (1984)  
Target
Name:
DNA topoisomerase 3
Synonyms:
DNA topoisomerase III topB
Type:
PROTEIN
Mol. Mass.:
81515.22
Organism:
Bacillus subtilis
Description:
ChEMBL_54525
Residue:
727
  
Inhibitor
Name:
BDBM50405106
Synonyms:
CHEMBL53109
Type:
Small organic molecule
Emp. Form.:
C15H19N3O2
Mol. Mass.:
273.3303
SMILES:
CCCCc1ccc(Nc2cc(=O)[nH]c(=O)[nH]2)cc1C
: