Target
Arabinose 5-phosphate isomerase KdsD
Ligand
BDBM50405144
Substrate
Meas. Tech.
ChEMBL_36028 (CHEMBL646429)
IC50
4700000±n/a nM
Citation
 Bigham, ECGragg, CEHall, WRKelsey, JEMallory, WRRichardson, DCBenedict, CRay, PH Inhibition of arabinose 5-phosphate isomerase. An approach to the inhibition of bacterial lipopolysaccharide biosynthesis. J Med Chem 27:717-26 (1984)  
Target
Name:
Arabinose 5-phosphate isomerase KdsD
Synonyms:
Arabinose 5-phosphate isomerase kdsD
Type:
PROTEIN
Mol. Mass.:
35000.37
Organism:
Salmonella typhimurium
Description:
ChEMBL_36028
Residue:
328
  
Inhibitor
Name:
BDBM50405144
Synonyms:
CHEMBL1161485
Type:
Small organic molecule
Emp. Form.:
C5H10FO8P
Mol. Mass.:
248.1003
SMILES:
OC(COP(O)(O)=O)C(O)C(F)C(O)=O
: