Target
Arabinose 5-phosphate isomerase KdsD
Ligand
BDBM50405145
Substrate
Meas. Tech.
ChEMBL_36028 (CHEMBL646429)
IC50
19200000±n/a nM
Citation
 Bigham, ECGragg, CEHall, WRKelsey, JEMallory, WRRichardson, DCBenedict, CRay, PH Inhibition of arabinose 5-phosphate isomerase. An approach to the inhibition of bacterial lipopolysaccharide biosynthesis. J Med Chem 27:717-26 (1984)  
Target
Name:
Arabinose 5-phosphate isomerase KdsD
Synonyms:
Arabinose 5-phosphate isomerase kdsD
Type:
PROTEIN
Mol. Mass.:
35000.37
Organism:
Salmonella typhimurium
Description:
ChEMBL_36028
Residue:
328
  
Inhibitor
Name:
BDBM50405145
Synonyms:
CHEMBL608478
Type:
Small organic molecule
Emp. Form.:
C6H10NO9S
Mol. Mass.:
272.21
SMILES:
O[C@H]1O[C@H](COC(=O)NS([O-])(=O)=O)[C@@H](O)[C@@H]1O
: