Target
D(1A)/D(1B)/D(2)/D(3)/D(4) dopamine receptor
Ligand
BDBM50366495
Substrate
Meas. Tech.
ChEMBL_59720 (CHEMBL874062)
IC50
50±n/a nM
Citation
 Guan, JHNeumeyer, JLFiler, CNAhern, DGLilly, LWatanabe, MGrigoriadis, DSeeman, P Aporphines. 58. N-(2-chloroethyl) [8,9-2H]norapomorphine, an irreversible ligand for dopamine receptors: synthesis and application. J Med Chem 27:806-10 (1984)  
Target
Name:
D(1A)/D(1B)/D(2)/D(3)/D(4) dopamine receptor
Synonyms:
Dopamine receptor
Type:
Mol. Mass.:
Description:
ASSAY_ID of ChEMBL is 357782
Components:
This complex has 5 components.
Component 1
Name:
D(1A) dopamine receptor
Synonyms:
DA D1 receptor DRD1 Dopamine D1 receptor Dopamine D1A
Type:
Enzyme
Mol. Mass.:
49303.43
Organism:
Homo sapiens (Human)
Description:
P21728
Residue:
446
  
Component 2
Name:
D(4) dopamine receptor
Synonyms:
D(2C) dopamine receptor DOPAMINE D4.2 DRD4 Dopamine D4 receptor
Type:
Enzyme
Mol. Mass.:
48373.19
Organism:
Homo sapiens (Human)
Description:
P21917
Residue:
419
  
Component 3
Name:
D(1B) dopamine receptor
Synonyms:
D(5) dopamine receptor DOPAMINE D5 DRD1L2 DRD5_HUMAN | dopamine receptor D5
Type:
Protein
Mol. Mass.:
52943.41
Organism:
Homo sapiens (Human)
Description:
P21918
Residue:
477
  
Component 4
Name:
D(2) dopamine receptor
Synonyms:
D(2) dopamine receptor DOPAMINE D2 Long DRD2 Dopamine D2 receptor Dopamine D2 receptor (D2R) Dopamine2-like | d2
Type:
Cell-surface receptors
Mol. Mass.:
50647.10
Organism:
Homo sapiens (Human)
Description:
P14416
Residue:
443
  
Component 5
Name:
D(3) dopamine receptor
Synonyms:
DOPAMINE D3 DRD3_HUMAN Dopamine D3 receptor (D3) Dopamine receptor Dopamine receptor D3
Type:
Mol. Mass.:
44243.43
Organism:
Homo sapiens (Human)
Description:
Residue:
400
  
Inhibitor
Name:
BDBM50366495
Synonyms:
(+)butaclamol | CHEMBL1255588
Type:
Small organic molecule
Emp. Form.:
C25H31NO
Mol. Mass.:
361.5197
SMILES:
CC(C)(C)[C@@]1(O)CCN2C[C@@H]3c4ccccc4CCc4cccc([C@H]2C1)c34
: