Target
Chymotrypsin-like elastase family member 1
Ligand
BDBM50405197
Substrate
Meas. Tech.
ChEBML_153468
Ki
3890451±n/a nM
Citation
 Spencer, RWCopp, LJPfister, JR Inhibition of human leukocyte elastase, porcine pancreatic elastase, and chymotrypsin by elasnin and other 4-hydroxy-2-pyrones. J Med Chem 28:1828-32 (1986)  
Target
Name:
Chymotrypsin-like elastase family member 1
Synonyms:
CELA1 ELA1 Elastase 1 Pancreatic elastase
Type:
Enzyme
Mol. Mass.:
28827.71
Organism:
Sus scrofa (Pig)
Description:
P00772
Residue:
266
  
Inhibitor
Name:
BDBM50405197
Synonyms:
CHEMBL51918
Type:
Small organic molecule
Emp. Form.:
C7H8O3
Mol. Mass.:
140.1366
SMILES:
Cc1cc(O)c(C)c(=O)o1
: