Target
Chymotrypsin-C
Ligand
BDBM50405197
Substrate
Meas. Tech.
ChEBML_49611
Ki
3467369±n/a nM
Citation
 Spencer, RWCopp, LJPfister, JR Inhibition of human leukocyte elastase, porcine pancreatic elastase, and chymotrypsin by elasnin and other 4-hydroxy-2-pyrones. J Med Chem 28:1828-32 (1986)  
Target
Name:
Chymotrypsin-C
Synonyms:
CLCR CTRC_HUMAN Chymotrypsin Chymotrypsin-C
Type:
Enzyme
Mol. Mass.:
29487.98
Organism:
Homo sapiens (Human)
Description:
Q99895
Residue:
268
  
Inhibitor
Name:
BDBM50405197
Synonyms:
CHEMBL51918
Type:
Small organic molecule
Emp. Form.:
C7H8O3
Mol. Mass.:
140.1366
SMILES:
Cc1cc(O)c(C)c(=O)o1
: