Target
Lutropin-choriogonadotropic hormone receptor
Ligand
BDBM50405783
Substrate
Meas. Tech.
ChEMBL_100146 (CHEMBL712503)
Ki
2.2±n/a nM
Citation
 Haviv, FPalabrica, CABush, ENDiaz, GJohnson, ESLove, SGreer, J Active reduced-size hexapeptide analogues of luteinizing hormone-releasing hormone. J Med Chem 32:2340-4 (1989)  
Target
Name:
Lutropin-choriogonadotropic hormone receptor
Synonyms:
LH/CG-R LSHR_RAT Luteinizing hormone receptor Lutropin-choriogonadotropic hormone receptor
Type:
PROTEIN
Mol. Mass.:
78049.26
Organism:
Rattus norvegicus
Description:
ChEMBL_97289
Residue:
700
  
Inhibitor
Name:
BDBM50405783
Synonyms:
CHEMBL2369807
Type:
Small organic molecule
Emp. Form.:
C54H69N11O9
Mol. Mass.:
1016.194
SMILES:
CCNC(=O)[C@@H]1CCCN1C(=O)[C@H](CCCN=C(N)N)NC(=O)[C@H](CC(C)C)NC(=O)[C@@H](Cc1c[nH]c2ccccc12)NC(=O)[C@H](Cc1ccc(O)cc1)NC(=O)[C@H](CO)NC(=O)Cc1cccc2ccccc12
: